• Register
search
Log In

Recent questions tagged angular

1 vote
1 answer 17 views
Problem: I have gained fundamental knowledge on Angular2. I am taking help of online tutorials to learn Angular2. I am trying to create the angular 2 App with the angular cli I have written below command in my cmd: npm install angular-cli -g After above command I am ... an error . I am unable to debug above error. I need Angular2 expert who can help me in fixing above Angular2 error for me.
asked Jun 5 Martin K 6.6k points
1 vote
1 answer 24 views
Problem : I am very new to Angular 4. Please find below my component in Angular 4: @Component( { selector: 'input-extra-field', template: ` <div class="form-group" [formGroup]="formGroup" > <switch [attr.title]="field.etiquette" [attr.value]="field.valeur" ... .../../../forms/@angular/forms.es5.js.FormControlDirective.ngOnChanges (forms.es5.js:4617) Please guide me in fixing above Angular 4 error.
asked May 11 stewart 4k points
1 vote
1 answer 21 views
Problem : I am very new to Angular2. Currently I am trying to create the component after that it is set to the root component but still I am facing below error: Template parse errors: Can't bind to 'routerLink' since it isn't a known property of 'a'. I ... days on researching and trying to fix above error but unable to fix it so now I need Angular2 experts advice to quick fix my Angular2 error.
asked May 2 stewart 4k points
1 vote
2 answers 61 views
Problem : I am very new to Ionic, I have recently started working on Ionic but I am facing below error: Runtime Error Uncaught (in promise): Error: Module build failed: Error: ENOENT: no such file or directory, open '/Users/stewart/Development/ionic/theWhoZoo/src/pages ... say they do match. import { MyRatingModel } from '../model/myratingModel'; How can I fix above error need Ionic expert help.
asked Apr 22 stewart 4k points
1 vote
2 answers 281 views
Problem : I have recently started learning Angular2. I am trying to create the component but I am facing below error. &ldquo;Is an angular component, then verify that it is part of this module.&rdquo; KIndly find below my code for your reference. import { Component } from ' ... : ` <p>This is my Hello World article</p> ` }) export class MyHelloComponent { } Kindly help me in fixing above error.
asked Mar 30 morrisBson 3.2k points
1 vote
2 answers 47 views
Problem : I am beginner to Angular2. Currently I am trying to create a simple form in the Angular2 app but it is not working for me. I am facing below error. &ldquo;Can't bind to 'formGroup' since it isn't a known property of 'form'.&rdquo; I am struggling on this error from couple of days. Still I don&rsquo;t know how to fix above error. Is it possible for somebody to fix it for me?
asked Mar 27 morrisBson 3.2k points
0 votes
1 answer 83 views
Problem : I am beginner to Angular. I have recently started to use the ng serve but now I continuously get below error. &ldquo;A bad http response code (404) was received when fetching the script.&rdquo; I have already tried to do lot of research on it but still I don&rsquo;t have any solution on it. Can somebody help me in resolving the errors ?
asked Mar 5 mphil 2.3k points
0 votes
1 answer 522 views
Problem : I am beginner in using Angular material. I am trying to use autocomplete component in the Angular2 project. Please find below the code written for my component. import {Component, OnInit} from "@angular/core"; import {ActivatedRoute, Router} from "@angular/router"; ... ; I am struggling with this issue from past 2 days but unable to resolve it. Can somebody help me in fixing this issue?
asked Feb 27 mphil 2.3k points
0 votes
1 answer 73 views
Problem : I am beginner to Angular 2. Currently I am trying to learn more about the server rendering with the help of Angular2, I am trying to use the gulp instead of webpack. But my problem is when my server starts then I start facing below error : /Users/mphil ... using class decorators I have also tried some solutions mentioned online but they are not working on my code. How can I fix my code ?
asked Feb 25 mphil 2.3k points
0 votes
2 answers 28 views
Problem : Currently I am trying to learning angular 2 and angular CLI also I am using the angular CLI and angular 2 for a very first time to create the sandbox project. I ran the following command "ng serve" and it worked for me. After that I wanted to stop the command so ... port." I am trying to fix this error from past couple of days but unable to fix it. Can somebody help me in fixing it ?
asked Feb 24 mphil 2.3k points
0 votes
1 answer 31 views
Problem : I am facing below error when trying to launch my Angular app, even if my component is not displayed at all. &ldquo;Can't bind to 'ngmodel' since it isn't a known property of 'input'. ("&rdquo; How can I fix this issue?
asked Feb 19 mphil 2.3k points
0 votes
1 answer 943 views
Problem: I am currently wondering why I am getting below compile error if I just declare variable with var or let keywords? I want to say, below code goes well: export class MyAppComponent { myRefreshClickStream$: any; constructor(){ } } While this brings the error: export class MyAppComponent { var myRefreshClickStream$: any; constructor(){ } }
asked Jan 27 jwilliam 3.9k points
0 votes
1 answer 104 views
Problem : I face this following error after upgrading my angular-cli ERROR in Template parse errors: Can't bind to 'index' since it isn't a known property of 'tag'. ("own)="handleKeydown($event, item)"              (onTagEdited)="onTagEdited.emit(item)"              [ ... ts Above error happens only when I run the ng build --prod and works fine when I run the ng build without the parameters
asked Jan 21 jwilliam 3.9k points
0 votes
1 answer 382 views
Problem : I am facing below error as : node_modules/rxjs/internal/types.d.ts(81,44): error TS1005: ';' expected. After I tried to do the installation of Angular 6. Check the detailed error as below : ERROR in node_modules/rxjs/internal/types.d.ts(81,44): ... internal/types.d.ts(81,76): error TS1005: ';' expected. node_modules/rxjs/internal/types.d.ts(81,78): error TS1109: Expression expected.
asked Dec 18, 2019 alecxe 7.5k points
0 votes
1 answer 766 views
Problem : I am facing following error when I try to use the CLI to create a new component : Could not find an ngmodule. use the skip-import option to skip importing in ngmodule. using below command : ng g c my-component --project=my-project But no component is created. I also tried by dropping the --project ... :- 6.0.6 5. Rxjs:- 6.2.1 6. Typescript:- 2.7.2 7. Webpack :- 4.8.3 8. nrwl/nx:- 6.1.0
asked Dec 9, 2019 alecxe 7.5k points
0 votes
1 answer 1.2K views
Problem : I am facing following error from the Angular 2 core.umd.js:5995 EXCEPTION: Uncaught (in promise): Error: Error in app/model_exposure_currencies/model_exposure_currencies.component.html:57:18 caused by: If ngModel is used within a form tag, either the name attribute must be set or the form ... 0-9]+)?" required> </div> </td> Below is my form tag: <form #f="ngForm" (ngSubmit)="onSubmit()">
asked Dec 3, 2019 alecxe 7.5k points
0 votes
1 answer 45 views
Problem : I have upgraded my Angular 4 project using angular-seed but now facing following error please include either "browseranimationsmodule" or "noopanimationsmodule" in your application.
asked Nov 14, 2019 peterlaw 6.9k points
To see more, click for the full list of questions or popular tags.