• Register

Recent questions tagged build

0 votes
1 answer 2 views
Problem: I need to solve this matter, please help >Android studio gradle project sync failed basic functionality.
asked 20 hours ago Danyal Sjoerd 2.6k points
0 votes
1 answer 2 views
Problem: unable to connect to adb.check the event log for a possible issue, verify that localhost entry is pointing to 127.0.0.1 or:: 1 for ipv4 or ipv6 Tried adb kill-server, restart, invalidate restart nothing works. Same issue reported over here https:// ... : I have not added any file or anything in studio, it's fresh installed Studio after format a full system still issue is there.
asked 4 days ago Yeamin 22k points
0 votes
1 answer 6 views
Problem: I know running javac file1.java produces file1.class if file1.java is the only source file, then I can just say java file1 to run it. However, if I have 2 source files, file1.java and file2.java, then how do I build the program?
asked 4 days ago anika11 32.2k points
0 votes
1 answer 15 views
Problem: I've installed Android studio 3.0.1 and tried to build very first app with choosing an empty activity, but I've get the message: Gradle project sync failed. Basic functionality (e.g. editing, debugging) will not work properly and error message like this: ... I've tried some suggested solution like changing gradle version, update Kotlin plugin(!) and so, but they didn't work. Any solution?
asked 6 days ago jamuna1 30.2k points
0 votes
1 answer 4 views
Problem: I am starting to explore gradle and the question might be naive. I have noted from the gradle docs about below plugin- apply plugin: 'application' The Application plugin facilitates creating an executable JVM application. It makes it easy to start ... is used to make the jar runnable/creating executable JVM application. Does that mean skipping does not make the application executable ?
asked 6 days ago ochena 23.3k points
0 votes
1 answer 2 views
Problem: I have upgraded my Android Studio and I found many problems in the latest version. Although many similar questions exist, I checked the answers to all and none of them worked for me! Here is the error I'm facing while compiling the code: ... ERROR, text=Program type already present: android.support.v4.app.BackStackRecord$Op, sources=[Unknown source file], tool name=Optional.of(D8)}.
asked 6 days ago Humaira ahmed 50.7k points
0 votes
1 answer 2 views
Problem: I got an error of node_modules/rxjs/internal/types.d.ts(81,44): error TS1005: ';' expected. after the installation of Angular 6. Check the error: ERROR in node_modules/rxjs/internal/types.d.ts(81,44): error TS1005: ';' expected. node_modules/rxjs/internal/types.d.ts(81,74): error TS1005: ';' expected. node_modules/rxjs/internal/types.d.ts(81,77): error TS1109: Expression expected.
asked May 1 ochena 23.3k points
0 votes
1 answer 7 views
Problem: I am stuck now .. need some suggestions .. please help me .. Note some input files use or override a deprecated api
asked Apr 26 Ifra 36.4k points
0 votes
1 answer 2 views
Problem: I encountered an error using the NDK way to compile the source code, I will opencv source code copied to the jni directory, prepared Android.mk and Application.mk as well as the source file. Mk file, compiled the following error, please also Give some advice ... generated. make: *** [/home/jiangc/opencv3.3Ndk/hello-jni/obj/local/armeabi-v7a/objs/opencv/core/src/cuda_host_mem.o] Error 1
asked Apr 26 anika11 32.2k points
0 votes
1 answer 4 views
Problem: I got an error of: node_modules/rxjs/internal/types.d.ts(81,44): error TS1005: ';' expected. after the installation of Angular 6. Check the error: ERROR in node_modules/rxjs/internal/types.d.ts(81,44): error TS1005: ';' expected. node_modules/rxjs/internal/types.d.ts(81,74): error TS1005: ';' expected. node_modules/rxjs/internal/types.d.ts(81,77): error TS1109: Expression expected.
asked Apr 26 anika11 32.2k points
0 votes
1 answer 2 views
Problem: I am building a project through the command line and not inside and I get an error: 39>path_to_project.csproj(245,3): error MSB4019: The imported project "C:\Program Files
asked Apr 23 ummeshani 9.5k points
0 votes
1 answer 5 views
Problem: Await operator can only be used within an Async method.I checked out some examples on MSDN and it looks to me like this code should be working, but instead I'm getting a build error on the line containing "await QueryRover();" Am I going crazy or is something fishy happening?
asked Apr 20 Humaira ahmed 50.7k points
0 votes
1 answer 4 views
Problem: I am using NetBeans with the minGW compiler. The problem is every time I build or attempt to run the project, I get an error: BUILD FAILED (exit value 2, total time: 38s)
asked Apr 11 ummesalma 29.2k points
0 votes
1 answer 4 views
Problem: Any ideas on what I need to fix this>cannot find module '../build/release/bson'?thanks
asked Apr 3 ashik 14.6k points
0 votes
1 answer 17 views
Problem: how can solve this question please solve it... the two build files generated by android studio are in ________________.
asked Apr 1 Ifra 36.4k points
0 votes
1 answer 9 views
Problem: How can I deal with this problem: gradle project sync failed. basic functionality (e.g. editing debugging) will not work properly
asked Apr 1 rakib1 51.5k points
0 votes
1 answer 3 views
Problem: i need some help about this problem please help? there should be 'data' folder next to the executable
asked Mar 26 Rohit kr 17.5k points
0 votes
1 answer 11 views
Problem: I used Google to try to find a solution on the web of the above question, But I got no useful hints. Can I get Pointer information about my problem with this?
asked Mar 21 shamimkhan 15.1k points
0 votes
1 answer 11 views
Problem: I get this error in my Logcat: Manifest merger failed with multiple errors, see logs that I have Linked with it
asked Mar 17 ummesalma 29.2k points
0 votes
1 answer 41 views
Problem: warning:unable to find optional library: org.apache.http.legacy
asked Feb 21 charles mathews 5.5k points