• Register

Recent questions tagged maven

0 votes
1 answer 10 views
Problem: I am getting the Maven error "The JAVA_HOME environment variable is not defined correctly" when I run through Inno setup batch execution. However, I am able to run successfully outside Inno Setup.(e.g Command line, Batch file, Vbs). I am clueless to identify the issue.
asked 6 days ago Ali 4.4k points
0 votes
1 answer 7 views
Problem: The java_home environment variable is not defined correctly.
asked Feb 18 Ethan ross 1.8k points
0 votes
1 answer 5 views
Problem: web.xml is missing and <failonmissingwebxml> is set to true.
asked Feb 17 Dan phillip 1.9k points
0 votes
1 answer 14 views
Problem: could not publish to the server. java.lang.indexoutofboundsexception
asked Feb 12 Shovo210 2.5k points
0 votes
1 answer 73 views
Problem: I am very new to eclipse and maven. Currently I am using the Eclipse Luna with a m2e plug-in. If I try to search for dependencies then I immediately receive the subsequent warning message: &ldquo;Index downloads are disabled, search result may be incomplete. ... exact solution on my above error. So I want to know the way to enable index downloads in my Eclipse for Maven dependency search.
asked Aug 13, 2020 Raphael Pacheco 4.9k points
0 votes
1 answer 98 views
Problem: I am creating my android application with the help of android studio. I have also added the required library to my project which was downloaded from the authentic source. When I was trying to add this library to the project created my me then it was showing ... 2, 0) Plugin with id 'com.github.dcendents.android-maven' not found." Please guide me in fixing above android app related error.
asked Aug 1, 2020 Raphael Pacheco 4.9k points
0 votes
1 answer 14 views
Problem: I am trying to load Java Web App into the Eclipse (via the Import Maven Project) but I am facing below error which says: "Cannot change version of project facet Dynamic Web Module to 2.5". I am trying to do research on the above error and one thing I ... >  <installed facet="wst.jsdt.web" version="1.0"/> </faceted-project> Can someone help me in fixing above project facet related error.
asked Jul 7, 2020 Raphael Pacheco 4.9k points
0 votes
0 answers 36 views
Problem: I have fundamental knowledge of Java and Maven. I am currently using the maven to create the dynamic webapp in a Eclipse IDE. I have already added some folders like src/test/java and src/test/resources. Also I have changed a library in a Java Build ... change version of project facet Dynamic Web Module to 3.1. I have already changed everything that would affect the changing I guess so.
asked Jun 16, 2020 Raphael Pacheco 4.9k points
1 vote
1 answer 318 views
Problem: Hello Guys, I am trying to import a Maven project in my Eclipse IDE but the project is not importing properly. It shows an error, source folder is not a java project when I m trying to give it a new call-in it. The problem is literally going over my head ... the problem, as well as have a solution, please speak up. I'm surfing over the internet for an hour but couldn&rsquo;t fix this yet.
asked Apr 2, 2020 Gavin 15.3k points
1 vote
2 answers 267 views
Problem: Dear all, Right now I&rsquo;ve imported a maven project into my eclipse IDE and I changed my java path library to work on java 1.7 Suddenly, eclipse started showing an error but I&rsquo;ve got no errors in my files there. The error is &ldquo;java compiler level ... Project Problem (Java Version Mismatch) Please tell me how to resolve this error (I want to have my JRE version as 1.7 only).
asked Mar 22, 2020 Gavin 15.3k points
0 votes
2 answers 542 views
Problem : I am new to Programming. I have created a Maven Project, the JavaScript project is cloned as the git sub-module inside Maven Project. My directory structure is as below mavenapp/src/main/javascript/[npm project files] and inside the package.json my test is looking as below : " ... install But it is not working for me.. npm version : 5.5.1 node version : 9.3.0 How can I fix above error?
asked Mar 3, 2020 mphil 2.3k points
0 votes
2 answers 113 views
Problem : I want to compile a project in Eclipse using the m2eclipse. I set my JDK path in Eclipse as below: Windows-->preferences-->installed jres--> jdk1.7.xx path But this is showing me below error [ERROR] COMPILATION ERROR : [INFO] ------------------------------------------------------------- [ ... BUILD FAILURE [INFO] ------------------------------------------------------------------------
asked Feb 4, 2020 jwilliam 3.9k points
0 votes
1 answer 5.4K views
Problem : I am developing the application in Spring, using a Tomcat, Mysql5, Java8... My problem is that I cannot deploy it, due to the "required bean 'entityManagerFactory' not found" problem. I have developed my project with the coworkers but ... a bean named 'entityManagerFactory' that could not be found. Action: Consider defining a bean named 'entityManagerFactory' in your configuration.
asked Jan 25, 2020 jwilliam 3.9k points
0 votes
2 answers 426 views
Problem : I want to run the spring-boot application which uses thre hibernate via spring-jpa, but i am facing below error: Caused by: org.hibernate.HibernateException: Access to DialectResolutionInfo ... .AbstractServiceRegistryImpl.initializeService(AbstractServiceRegistryImpl.java:345) at org.hibernate.service.internal.AbstractServiceRegistryImpl.getService(AbstractServiceRegistryImpl.java:308)
asked Jan 3, 2020 alecxe 7.5k points
0 votes
1 answer 3.2K views
Problem : I need to build the Spring-Boot *.war with maven, but I keep facing below error: [WARNING] The requested profile "pom.xml" could not be activated because it does not exist. After completely running the mvn: clean. After the success my ... : Failed to execute goal org.apache.maven.plugins:maven-compiler-plugin:3.1:compile (default-compile) on project webconsultas: Fatal error compiling
asked Dec 24, 2019 alecxe 7.5k points
0 votes
2 answers 274 views
Problem : I am stuck with following Maven issue. Error: could not find or load main class org.codehaus.plexus.classworlds.launcher.launcher My Maven was working fine till last week after that I do not know what went wrong with it now it gives me the error I have tried replacing ... Java(TM) SE Runtime Environment (build 1.7.0_75-b13) Java HotSpot(TM) 64-Bit Server VM (build 24.75-b04, mixed mode)
asked Nov 24, 2019 alecxe 7.5k points
0 votes
2 answers 422 views
Problem : When ever I run mvn --version command from inside the bin it gives me the version but when I run it from the outside of bin it gives following exception : 'mvn' is not recognized as an internal or external command, operable program or batch file.
asked Nov 18, 2019 peterlaw 6.9k points
0 votes
1 answer 61 views
Problem : Getting bellow error because of Maven Compiler Plugin failed to execute goal org.apache.maven.plugins:maven-compiler-plugin:3.1:compile (default-compile)
asked Nov 7, 2019 peterlaw 6.9k points
0 votes
1 answer 53 views
Problem : I created a project by Maven integration in Eclipse , but in the work space in all JSP files have bellow message: The superclass "javax.servlet.http.HttpServlet" was not found on the Java Build Path
asked Oct 31, 2019 peterlaw 6.9k points